Reaction Details
TargetTyrosine-protein kinase BTK
LigandBDBM50134365
Substrate/Competitorn/a
Meas. Tech.ChEMBL_1544943 (CHEMBL3748502)
IC50 18±n/a nM
Citation Young, WBBarbosa, JBlomgren, PBremer, MCCrawford, JJDambach, DEigenbrot, CGallion, SJohnson, ARKropf, JELee, SHLiu, LLubach, JWMacaluso, JMaciejewski, PMitchell, SAOrtwine, DFDi Paolo, JReif, KScheerens, HSchmitt, AWang, XWong, HXiong, JMXu, JYu, CZhao, ZCurrie, KS Discovery of highly potent and selective Bruton's tyrosine kinase inhibitors: Pyridazinone analogs with improved metabolic stability. Bioorg Med Chem Lett26:575-9 (2016) 
 
Tyrosine-protein kinase BTK
Name:Tyrosine-protein kinase BTK
Type:PROTEIN
Mol. Mass.:76447.19
Organism:Mus musculus
Description:ChEMBL_108319
Residue:659
BDBM50134365
NameBDBM50134365
Synonyms:CHEMBL3745935
TypeSmall organic molecule
Emp. Form.C26H21F2N7O2S
Mol. Mass.533.552
SMILESCN1CCn2nc(Nc3cc(n[nH]c3=O)-c3ccc(F)c(NC(=O)c4cc5ccccc5s4)c3F)cc2C1