Reaction Details
TargetTyrosine-protein kinase BTK
LigandBDBM50134320
Substrate/Competitorn/a
Meas. Tech.ChEMBL_1544943 (CHEMBL3748502)
IC50 91±n/a nM
Citation Young, WBBarbosa, JBlomgren, PBremer, MCCrawford, JJDambach, DEigenbrot, CGallion, SJohnson, ARKropf, JELee, SHLiu, LLubach, JWMacaluso, JMaciejewski, PMitchell, SAOrtwine, DFDi Paolo, JReif, KScheerens, HSchmitt, AWang, XWong, HXiong, JMXu, JYu, CZhao, ZCurrie, KS Discovery of highly potent and selective Bruton's tyrosine kinase inhibitors: Pyridazinone analogs with improved metabolic stability. Bioorg Med Chem Lett26:575-9 (2016) 
 
Tyrosine-protein kinase BTK
Name:Tyrosine-protein kinase BTK
Type:PROTEIN
Mol. Mass.:76447.19
Organism:Mus musculus
Description:ChEMBL_108319
Residue:659
BDBM50134320
NameBDBM50134320
Synonyms:CHEMBL3746293
TypeSmall organic molecule
Emp. Form.C27H24FN7O2S
Mol. Mass.529.589
SMILESCN1CCn2nc(Nc3cc(n[nH]c3=O)-c3ccc(F)c(NC(=O)c4cc5ccccc5s4)c3C)cc2C1