Reaction Details
TargetAcetylcholinesterase
LigandBDBM50138279
Substrate/Competitorn/a
Meas. Tech.ChEMBL_1549917 (CHEMBL3755064)
Ki 0.720000±n/a nM
Citation Zha, XLamba, DZhang, LLou, YXu, CKang, DChen, LXu, YZhang, LDe Simone, ASamez, SPesaresi, AStojan, JLopez, MGEgea, JAndrisano, VBartolini, M Novel Tacrine-Benzofuran Hybrids as Potent Multitarget-Directed Ligands for the Treatment of Alzheimer's Disease: Design, Synthesis, Biological Evaluation, and X-ray Crystallography. J Med Chem59:114-31 (2016) 
 
Acetylcholinesterase
Name:Acetylcholinesterase
Type:Enzyme
Mol. Mass.:67792.70
Organism:Homo sapiens (Human)
Description:P22303
Residue:614
BDBM50138279
NameBDBM50138279
Synonyms:CHEMBL3752467
TypeSmall organic molecule
Emp. Form.C29H35N3O
Mol. Mass.441.6077
SMILESC(CCCNCc1cc2ccccc2o1)CCCNc1c2CCCCc2nc2ccccc12