Reaction Details
TargetBeta-secretase 1
LigandBDBM50140172
Substrate/Competitorn/a
Meas. Tech.ChEMBL_1554144 (CHEMBL3769116)
IC50 343000±n/a nM
Citation Di Martino, RMDe Simone, AAndrisano, VBisignano, PBisi, AGobbi, SRampa, AFato, RBergamini, CPerez, DIMartinez, ABottegoni, GCavalli, ABelluti, F Versatility of the Curcumin Scaffold: Discovery of Potent and Balanced Dual BACE-1 and GSK-3ß Inhibitors. J Med Chem59:531-44 (2016) 
 
Beta-secretase 1
Name:Beta-secretase 1
Type:Protein
Mol. Mass.:55755.10
Organism:Homo sapiens (Human)
Description:P56817
Residue:501
BDBM50140172
NameBDBM50140172
Synonyms:CHEBI:3962 Curcumin | US9409845, Table 1, Compound 21: curcumin
TypeSmall organic molecule
Emp. Form.C21H20O6
Mol. Mass.368.3799
SMILESCOc1cc(\C=C\C(=O)CC(=O)\C=C\c2ccc(O)c(OC)c2)ccc1O