Reaction Details
TargetBeta-secretase 1
LigandBDBM50145908
Substrate/Competitorn/a
Meas. Tech.ChEMBL_1554144 (CHEMBL3769116)
IC50 140±n/a nM
Citation Di Martino, RMDe Simone, AAndrisano, VBisignano, PBisi, AGobbi, SRampa, AFato, RBergamini, CPerez, DIMartinez, ABottegoni, GCavalli, ABelluti, F Versatility of the Curcumin Scaffold: Discovery of Potent and Balanced Dual BACE-1 and GSK-3ß Inhibitors. J Med Chem59:531-44 (2016) 
 
Beta-secretase 1
Name:Beta-secretase 1
Type:Protein
Mol. Mass.:55755.10
Organism:Homo sapiens (Human)
Description:P56817
Residue:501
BDBM50145908
NameBDBM50145908
Synonyms:CHEMBL3763318
TypeSmall organic molecule
Emp. Form.C21H20O4
Mol. Mass.336.3811
SMILESCOc1cc(\C=C\C(\O)=C\C(=O)\C=C\c2ccc(C)cc2)ccc1O