Reaction Details
TargetHistone-lysine N-methyltransferase EZH2
LigandBDBM50149647
Substrate/Competitorn/a
Meas. Tech.ChEMBL_1558364 (CHEMBL3772956)
IC50 1100±n/a nM
Citation Kuntz, KWCampbell, JEKeilhack, HPollock, RMKnutson, SKPorter-Scott, MRichon, VMSneeringer, CJWigle, TJAllain, CJMajer, CRMoyer, MPCopeland, RAChesworth, R The Importance of Being Me: Magic Methyls, Methyltransferase Inhibitors, and the Discovery of Tazemetostat. J Med Chem59:1556-64 (2016) 
 
Histone-lysine N-methyltransferase EZH2
Name:Histone-lysine N-methyltransferase EZH2
Type:Protein
Mol. Mass.:85367.84
Organism:Homo sapiens (Human)
Description:Q15910
Residue:746
BDBM50149647
NameBDBM50149647
Synonyms:CHEMBL3771291 US9637472, Compound D-71
TypeSmall organic molecule
Emp. Form.C19H22N4O2
Mol. Mass.338.4036
SMILESCC(C)n1ncc2c(cccc12)C(=O)NCc1c(C)cc(C)[nH]c1=O