Reaction Details
TargetHistone-lysine N-methyltransferase EZH2
LigandBDBM50149878
Substrate/Competitorn/a
Meas. Tech.ChEMBL_1558364 (CHEMBL3772956)
IC50 2200±n/a nM
Citation Kuntz, KWCampbell, JEKeilhack, HPollock, RMKnutson, SKPorter-Scott, MRichon, VMSneeringer, CJWigle, TJAllain, CJMajer, CRMoyer, MPCopeland, RAChesworth, R The Importance of Being Me: Magic Methyls, Methyltransferase Inhibitors, and the Discovery of Tazemetostat. J Med Chem59:1556-64 (2016) 
 
Histone-lysine N-methyltransferase EZH2
Name:Histone-lysine N-methyltransferase EZH2
Type:Protein
Mol. Mass.:85367.84
Organism:Homo sapiens (Human)
Description:Q15910
Residue:746
BDBM50149878
NameBDBM50149878
Synonyms:CHEMBL3770059
TypeSmall organic molecule
Emp. Form.C20H23BrN6O2
Mol. Mass.459.34
SMILESCc1cc(C)c(CNC(=O)c2cc(Br)nc3n(ncc23)C2CCNCC2)c(=O)[nH]1