Reaction Details
TargetHistone-lysine N-methyltransferase EZH2
LigandBDBM50149901
Substrate/Competitorn/a
Meas. Tech.ChEMBL_1558364 (CHEMBL3772956)
IC50 30±n/a nM
Citation Kuntz, KWCampbell, JEKeilhack, HPollock, RMKnutson, SKPorter-Scott, MRichon, VMSneeringer, CJWigle, TJAllain, CJMajer, CRMoyer, MPCopeland, RAChesworth, R The Importance of Being Me: Magic Methyls, Methyltransferase Inhibitors, and the Discovery of Tazemetostat. J Med Chem59:1556-64 (2016) 
 
Histone-lysine N-methyltransferase EZH2
Name:Histone-lysine N-methyltransferase EZH2
Type:Protein
Mol. Mass.:85367.84
Organism:Homo sapiens (Human)
Description:Q15910
Residue:746
BDBM50149901
NameBDBM50149901
Synonyms:CHEMBL3770820
TypeSmall organic molecule
Emp. Form.C23H27ClF3N3O3
Mol. Mass.485.927
SMILESCCN(C1CCOCC1)c1cc(Cl)cc(C(=O)NCc2c(cc(C)[nH]c2=O)C(F)(F)F)c1C