Reaction Details
TargetHistone-lysine N-methyltransferase EZH2
LigandBDBM50149882
Substrate/Competitorn/a
Meas. Tech.ChEMBL_1558366 (CHEMBL3772958)
EC50 500±n/a nM
Citation Kuntz, KWCampbell, JEKeilhack, HPollock, RMKnutson, SKPorter-Scott, MRichon, VMSneeringer, CJWigle, TJAllain, CJMajer, CRMoyer, MPCopeland, RAChesworth, R The Importance of Being Me: Magic Methyls, Methyltransferase Inhibitors, and the Discovery of Tazemetostat. J Med Chem59:1556-64 (2016) 
 
Histone-lysine N-methyltransferase EZH2
Name:Histone-lysine N-methyltransferase EZH2
Type:Protein
Mol. Mass.:85367.84
Organism:Homo sapiens (Human)
Description:Q15910
Residue:746
BDBM50149882
NameBDBM50149882
Synonyms:CHEMBL3771083
TypeSmall organic molecule
Emp. Form.C22H28BrN3O2
Mol. Mass.446.381
SMILESCN(C1CCCC1)c1cc(Br)cc(C(=O)NCc2c(C)cc(C)[nH]c2=O)c1C