Reaction Details
TargetLysine-specific demethylase 4A
LigandBDBM50153116
Substrate/Competitorn/a
Meas. Tech.ChEMBL_1561969 (CHEMBL3778805)
IC50 21800±n/a nM
Citation Bavetsias, VLanigan, RMRuda, GFAtrash, BMcLaughlin, MGTumber, AMok, NYLe Bihan, YVDempster, SBoxall, KJJeganathan, FHatch, SBSavitsky, PVelupillai, SKrojer, TEngland, KSSejberg, JThai, CDonovan, APal, AScozzafava, GBennett, JMKawamura, AJohansson, CSzykowska, AGileadi, CBurgess-Brown, NAvon Delft, FOppermann, UWalters, ZShipley, JRaynaud, FIWestaway, SMPrinjha, RKFedorov, OBurke, RSchofield, CJWestwood, IMBountra, CMüller, Svan Montfort, RLBrennan, PEBlagg, J 8-Substituted Pyrido[3,4-d]pyrimidin-4(3H)-one Derivatives As Potent, Cell Permeable, KDM4 (JMJD2) and KDM5 (JARID1) Histone Lysine Demethylase Inhibitors. J Med Chem59:1388-409 (2016) 
 
Lysine-specific demethylase 4A
Name:Lysine-specific demethylase 4A
Type:Enzyme
Mol. Mass.:120647.83
Organism:Homo sapiens (Human)
Description:O75164
Residue:1064
BDBM50153116
NameBDBM50153116
Synonyms:CHEMBL3774672
TypeSmall organic molecule
Emp. Form.C12H11N5O2
Mol. Mass.257.248
SMILESOCCc1cnn(c1)-c1nccc2c1nc[nH]c2=O