Reaction Details
TargetHistone deacetylase 1
LigandBDBM50150953
Substrate/Competitorn/a
Meas. Tech.ChEMBL_1560778 (CHEMBL3778475)
IC50 76±n/a nM
Citation Yang, ZWang, TWang, FNiu, TLiu, ZChen, XLong, CTang, MCao, DWang, XXiang, WYi, YMa, LYou, JChen, L Discovery of Selective Histone Deacetylase 6 Inhibitors Using the Quinazoline as the Cap for the Treatment of Cancer. J Med Chem59:1455-70 (2016) 
 
Histone deacetylase 1
Name:Histone deacetylase 1
Type:Enzyme
Mol. Mass.:55090.27
Organism:Homo sapiens (Human)
Description:Q13547
Residue:482
BDBM50150953
NameBDBM50150953
Synonyms:CHEMBL3775209
TypeSmall organic molecule
Emp. Form.C19H20N4O3
Mol. Mass.352.3871
SMILESCN(c1ccc(OCCCC(=O)NO)cc1)c1ncnc2ccccc12