Reaction Details
TargetHistone deacetylase 1
LigandBDBM50151326
Substrate/Competitorn/a
Meas. Tech.ChEMBL_1560778 (CHEMBL3778475)
IC50>1000±n/a nM
Citation Yang, ZWang, TWang, FNiu, TLiu, ZChen, XLong, CTang, MCao, DWang, XXiang, WYi, YMa, LYou, JChen, L Discovery of Selective Histone Deacetylase 6 Inhibitors Using the Quinazoline as the Cap for the Treatment of Cancer. J Med Chem59:1455-70 (2016) 
 
Histone deacetylase 1
Name:Histone deacetylase 1
Type:Enzyme
Mol. Mass.:55090.27
Organism:Homo sapiens (Human)
Description:Q13547
Residue:482
BDBM50151326
NameBDBM50151326
Synonyms:CHEMBL3774413
TypeSmall organic molecule
Emp. Form.C18H18N4O3
Mol. Mass.338.3605
SMILESCN(c1cccc(OCC(=O)NO)c1)c1nc(C)nc2ccccc12