Reaction Details
TargetHistone deacetylase 1
LigandBDBM50151373
Substrate/Competitorn/a
Meas. Tech.ChEMBL_1560778 (CHEMBL3778475)
IC50 73±n/a nM
Citation Yang, ZWang, TWang, FNiu, TLiu, ZChen, XLong, CTang, MCao, DWang, XXiang, WYi, YMa, LYou, JChen, L Discovery of Selective Histone Deacetylase 6 Inhibitors Using the Quinazoline as the Cap for the Treatment of Cancer. J Med Chem59:1455-70 (2016) 
 
Histone deacetylase 1
Name:Histone deacetylase 1
Type:Enzyme
Mol. Mass.:55090.27
Organism:Homo sapiens (Human)
Description:Q13547
Residue:482
BDBM50151373
NameBDBM50151373
Synonyms:CHEMBL3775539
TypeSmall organic molecule
Emp. Form.C22H26N4O3
Mol. Mass.394.4668
SMILESCN(c1cccc(OCCCCCC(=O)NO)c1)c1nc(C)nc2ccccc12