Reaction Details
TargetHistone deacetylase 1
LigandBDBM50151377
Substrate/Competitorn/a
Meas. Tech.ChEMBL_1560778 (CHEMBL3778475)
IC50 160±n/a nM
Citation Yang, ZWang, TWang, FNiu, TLiu, ZChen, XLong, CTang, MCao, DWang, XXiang, WYi, YMa, LYou, JChen, L Discovery of Selective Histone Deacetylase 6 Inhibitors Using the Quinazoline as the Cap for the Treatment of Cancer. J Med Chem59:1455-70 (2016) 
 
Histone deacetylase 1
Name:Histone deacetylase 1
Type:Enzyme
Mol. Mass.:55090.27
Organism:Homo sapiens (Human)
Description:Q13547
Residue:482
BDBM50151377
NameBDBM50151377
Synonyms:CHEMBL3774890
TypeSmall organic molecule
Emp. Form.C23H28N4O4
Mol. Mass.424.4928
SMILESCOc1ccc(cc1OCCCCCC(=O)NO)N(C)c1nc(C)nc2ccccc12