Reaction Details
TargetHistone deacetylase 8
LigandBDBM50150951
Substrate/Competitorn/a
Meas. Tech.ChEMBL_1560780 (CHEMBL3778477)
IC50 1422±n/a nM
Citation Yang, ZWang, TWang, FNiu, TLiu, ZChen, XLong, CTang, MCao, DWang, XXiang, WYi, YMa, LYou, JChen, L Discovery of Selective Histone Deacetylase 6 Inhibitors Using the Quinazoline as the Cap for the Treatment of Cancer. J Med Chem59:1455-70 (2016) 
 
Histone deacetylase 8
Name:Histone deacetylase 8
Type:Enzyme
Mol. Mass.:41749.60
Organism:Homo sapiens (Human)
Description:Q9BY41
Residue:377
BDBM50150951
NameBDBM50150951
Synonyms:CHEMBL3774793
TypeSmall organic molecule
Emp. Form.C17H16N4O3
Mol. Mass.324.3339
SMILESCN(c1ccc(OCC(=O)NO)cc1)c1ncnc2ccccc12