Reaction Details
TargetHistone deacetylase 7
LigandBDBM29589
Substrate/Competitorn/a
Meas. Tech.ChEMBL_1560791 (CHEMBL3778488)
IC50 4354±n/a nM
Citation Yang, ZWang, TWang, FNiu, TLiu, ZChen, XLong, CTang, MCao, DWang, XXiang, WYi, YMa, LYou, JChen, L Discovery of Selective Histone Deacetylase 6 Inhibitors Using the Quinazoline as the Cap for the Treatment of Cancer. J Med Chem59:1455-70 (2016) 
 
Histone deacetylase 7
Name:Histone deacetylase 7
Type:Chromatin regulator; hydrolase; repressor
Mol. Mass.:102942.62
Organism:Homo sapiens (Human)
Description:Q8WUI4
Residue:952
BDBM29589
NameBDBM29589
Synonyms:Faridak LBH-589B US10722597, Compound Panobinostat
TypeSmall organic molecule
Emp. Form.C21H23N3O2
Mol. Mass.349.4262
SMILESCc1[nH]c2ccccc2c1CCNCc1ccc(\C=C\C(=O)NO)cc1