Reaction Details
TargetLysine-specific histone demethylase 2
LigandBDBM50151586
Substrate/Competitorn/a
Meas. Tech.ChEMBL_1561056 (CHEMBL3776539)
IC50>50000±n/a nM
Citation Itoh, YAihara, KMellini, PTojo, TOta, YTsumoto, HSolomon, VRZhan, PSuzuki, MOgasawara, DShigenaga, AInokuma, TNakagawa, HMiyata, NMizukami, TOtaka, ASuzuki, T Identification of SNAIL1 Peptide-Based Irreversible Lysine-Specific Demethylase 1-Selective Inactivators. J Med Chem59:1531-44 (2016) 
 
Lysine-specific histone demethylase 2
Name:Lysine-specific histone demethylase 2
Type:PROTEIN
Mol. Mass.:92112.91
Organism:Homo sapiens (Human)
Description:ChEMBL_992590
Residue:822
BDBM50151586
NameBDBM50151586
Synonyms:CHEMBL3774631
TypeSmall organic molecule
Emp. Form.C102H173N37O29
Mol. Mass.2381.6955
SMILESCNNCCCC(NC(=O)C(CO)NC(=O)C(CCCNC(N)=N)NC(=O)C1CCCN1)C(=O)NC(CC(C)C)C(=O)NC(C(C)C)C(=O)NC(CCCNC(N)=N)C(=O)NC(CCCCN)C(=O)N1CCCC1C(=O)NC(CO)C(=O)NC(CC(O)=O)C(=O)N1CCCC1C(=O)NC(CC(N)=O)C(=O)NC(CCCNC(N)=N)C(=O)NC(CCCCN)C(=O)N1CCCC1C(=O)NC(CC(N)=O)C(=O)NC(Cc1ccc(O)cc1)C(=O)NC(CO)C(=O)NC(CCC(N)=O)C(N)=O