Reaction Details
TargetLysine-specific histone demethylase 1A
LigandBDBM50151583
Substrate/Competitorn/a
Meas. Tech.ChEMBL_1561055 (CHEMBL3776538)
IC50 320±n/a nM
Citation Itoh, YAihara, KMellini, PTojo, TOta, YTsumoto, HSolomon, VRZhan, PSuzuki, MOgasawara, DShigenaga, AInokuma, TNakagawa, HMiyata, NMizukami, TOtaka, ASuzuki, T Identification of SNAIL1 Peptide-Based Irreversible Lysine-Specific Demethylase 1-Selective Inactivators. J Med Chem59:1531-44 (2016) 
 
Lysine-specific histone demethylase 1A
Name:Lysine-specific histone demethylase 1A
Type:Enzyme
Mol. Mass.:92901.01
Organism:Homo sapiens (Human)
Description:O60341
Residue:852
BDBM50151583
NameBDBM50151583
Synonyms:CHEMBL3774920
TypeSmall organic molecule
Emp. Form.C149H267N69O37
Mol. Mass.3617.1544
SMILESCC(C)CC(NC(=O)C(CCCNN)NC(=O)C(CO)NC(=O)C(CCCNC(N)=N)NC(=O)C1CCCN1)C(=O)NC(C(C)C)C(=O)NC(CCCNC(N)=N)C(=O)NC(CCCCN)C(=O)N1CCCC1C(=O)NC(CO)C(=O)NC(CC(O)=O)C(=O)N1CCCC1C(=O)NC(CC(N)=O)C(=O)NC(CCCNC(N)=N)C(=O)NC(CCCCNC(=O)C(CCCNC(N)=N)NC(=O)C(CCCNC(N)=N)NC(=O)C(CCCNC(N)=N)NC(=O)C(CCCNC(N)=N)NC(=O)C(CCCNC(N)=N)NC(=O)C(CCCNC(N)=N)NC(=O)C(CCCNC(N)=N)NC(=O)C(N)CCCNC(N)=N)C(=O)N1CCCC1C(=O)NC(CC(N)=O)C(=O)NC(Cc1ccc(O)cc1)C(=O)NC(CO)C(=O)NC(CCC(N)=O)C(N)=O