Reaction Details
TargetCoagulation factor XI
LigandBDBM50153002
Substrate/Competitorn/a
Meas. Tech.ChEBML_1563872
Ki 6.7±n/a nM
Citation Corte, JRFang, TPinto, DJOrwat, MJRendina, ARLuettgen, JMRossi, KAWei, ARamamurthy, VMyers, JESheriff, SNarayanan, RHarper, TWZheng, JJLi, YXSeiffert, DAWexler, RRQuan, ML Orally bioavailable pyridine and pyrimidine-based Factor XIa inhibitors: Discovery of the methyl N-phenyl carbamate P2 prime group. Bioorg Med Chem24:2257-72 (2016) 
 
Coagulation factor XI
Name:Coagulation factor XI
Type:Enzyme
Mol. Mass.:70130.58
Organism:Homo sapiens (Human)
Description:P03951
Residue:625
BDBM50153002
NameBDBM50153002
Synonyms:CHEMBL3781363
TypeSmall organic molecule
Emp. Form.C30H25ClN8O3
Mol. Mass.581.024
SMILESCOC(=O)Nc1ccc(cc1)-c1cc(ncn1)[C@H](Cc1ccccc1)NC(=O)\C=C\c1cc(Cl)ccc1-n1cnnn1