Reaction Details
TargetCoagulation factor XI
LigandBDBM50153058
Substrate/Competitorn/a
Meas. Tech.ChEBML_1563872
Ki 7.5±n/a nM
Citation Corte, JRFang, TPinto, DJOrwat, MJRendina, ARLuettgen, JMRossi, KAWei, ARamamurthy, VMyers, JESheriff, SNarayanan, RHarper, TWZheng, JJLi, YXSeiffert, DAWexler, RRQuan, ML Orally bioavailable pyridine and pyrimidine-based Factor XIa inhibitors: Discovery of the methyl N-phenyl carbamate P2 prime group. Bioorg Med Chem24:2257-72 (2016) 
 
Coagulation factor XI
Name:Coagulation factor XI
Type:Enzyme
Mol. Mass.:70130.58
Organism:Homo sapiens (Human)
Description:P03951
Residue:625
BDBM50153058
NameBDBM50153058
Synonyms:CHEMBL3780189
TypeSmall organic molecule
Emp. Form.C28H31N5O2
Mol. Mass.469.578
SMILESNC[C@H]1CC[C@@H](CC1)C(=O)NC(Cc1ccccc1)c1cc(ccn1)-c1ccc2[nH]nc(O)c2c1