Reaction Details
TargetUrokinase-type plasminogen activator
LigandBDBM50153004
Substrate/Competitorn/a
Meas. Tech.ChEMBL_1564079 (CHEMBL3783220)
Ki>29730±n/a nM
Citation Corte, JRFang, TPinto, DJOrwat, MJRendina, ARLuettgen, JMRossi, KAWei, ARamamurthy, VMyers, JESheriff, SNarayanan, RHarper, TWZheng, JJLi, YXSeiffert, DAWexler, RRQuan, ML Orally bioavailable pyridine and pyrimidine-based Factor XIa inhibitors: Discovery of the methyl N-phenyl carbamate P2 prime group. Bioorg Med Chem24:2257-72 (2016) 
 
Urokinase-type plasminogen activator
Name:Urokinase-type plasminogen activator
Type:Enzyme
Mol. Mass.:48528.62
Organism:Homo sapiens (Human)
Description:P00749
Residue:431
BDBM50153004
NameBDBM50153004
Synonyms:CHEMBL3781319
TypeSmall organic molecule
Emp. Form.C31H26ClN7O3
Mol. Mass.580.036
SMILESCOC(=O)Nc1ccc(cc1)-c1ccnc(c1)[C@H](Cc1ccccc1)NC(=O)\C=C\c1cc(Cl)ccc1-n1cnnn1