Reaction Details
TargetALK tyrosine kinase receptor
LigandBDBM50157879
Substrate/Competitorn/a
Meas. Tech.ChEMBL_1565866 (CHEMBL3789970)
IC50>5500±n/a nM
Citation Fairhurst, RAMarsilje, THStutz, SBoos, ANiklaus, MChen, BJiang, SLu, WFuret, PMcCarthy, CStauffer, FGuagnano, VVaupel, AMichellys, PYSchnell, CJeay, S Optimisation of a 5-[3-phenyl-(2-cyclic-ether)-methyl-ether]-4-aminopyrrolopyrimidine series of IGF-1R inhibitors. Bioorg Med Chem Lett26:2057-64 (2016) 
 
ALK tyrosine kinase receptor
Name:ALK tyrosine kinase receptor
Type:Protein
Mol. Mass.:176453.10
Organism:Homo sapiens (Human)
Description:Q9UM73
Residue:1620
BDBM50157879
NameBDBM50157879
Synonyms:CHEMBL1614712
TypeSmall organic molecule
Emp. Form.C27H29N5O
Mol. Mass.439.5521
SMILES[H][C@]1(CN2CCC2)C[C@]([H])(C1)n1cc(-c2cccc(OCc3ccccc3)c2)c2c(N)ncnc12