Reaction Details
TargetMitogen-activated protein kinase kinase kinase 8
LigandBDBM50157628
Substrate/Competitorn/a
Meas. Tech.ChEMBL_1565896 (CHEMBL3790000)
IC50>10000±n/a nM
Citation Fairhurst, RAMarsilje, THStutz, SBoos, ANiklaus, MChen, BJiang, SLu, WFuret, PMcCarthy, CStauffer, FGuagnano, VVaupel, AMichellys, PYSchnell, CJeay, S Optimisation of a 5-[3-phenyl-(2-cyclic-ether)-methyl-ether]-4-aminopyrrolopyrimidine series of IGF-1R inhibitors. Bioorg Med Chem Lett26:2057-64 (2016) 
 
Mitogen-activated protein kinase kinase kinase 8
Name:Mitogen-activated protein kinase kinase kinase 8
Type:Serine/threonine-protein kinase
Mol. Mass.:52916.89
Organism:Homo sapiens (Human)
Description:P41279
Residue:467
BDBM50157628
NameBDBM50157628
Synonyms:CHEMBL3786167
TypeSmall organic molecule
Emp. Form.C27H33FN6O3
Mol. Mass.508.5877
SMILESCC(=O)N1CCN(CC1)[C@H]1C[C@H](C1)n1cc(-c2cccc(OC[C@@H]3CCCO3)c2F)c2c(N)ncnc12