Reaction Details
TargetAurora kinase A
LigandBDBM50157880
Substrate/Competitorn/a
Meas. Tech.ChEMBL_1565871 (CHEMBL3789975)
IC50 3100±n/a nM
Citation Fairhurst, RAMarsilje, THStutz, SBoos, ANiklaus, MChen, BJiang, SLu, WFuret, PMcCarthy, CStauffer, FGuagnano, VVaupel, AMichellys, PYSchnell, CJeay, S Optimisation of a 5-[3-phenyl-(2-cyclic-ether)-methyl-ether]-4-aminopyrrolopyrimidine series of IGF-1R inhibitors. Bioorg Med Chem Lett26:2057-64 (2016) 
 
Aurora kinase A
Name:Aurora kinase A
Type:Serine/threonine-protein kinase
Mol. Mass.:45830.98
Organism:Homo sapiens (Human)
Description:O14965
Residue:403
BDBM50157880
NameBDBM50157880
Synonyms:CHEMBL3787112
TypeSmall organic molecule
Emp. Form.C20H23N5O
Mol. Mass.349.4295
SMILESNc1ncnc2n(cc(-c3cccc(O)c3)c12)[C@@H]1C[C@H](CN2CCC2)C1