Reaction Details
TargetFatty-acid amide hydrolase 1
LigandBDBM50160284
Substrate/Competitorn/a
Meas. Tech.ChEMBL_1566100 (CHEMBL3791984)
IC50 4050±n/a nM
Citation Brindisi, MMaramai, SGemma, SBrogi, SGrillo, ADi Cesare Mannelli, LGabellieri, ELamponi, SSaponara, SGorelli, BTedesco, DBonfiglio, TLandry, CJung, KMArmirotti, ALuongo, LLigresti, APiscitelli, FBertucci, CDehouck, MPCampiani, GMaione, SGhelardini, CPittaluga, APiomelli, DDi Marzo, VButini, S Development and Pharmacological Characterization of Selective Blockers of 2-Arachidonoyl Glycerol Degradation with Efficacy in Rodent Models of Multiple Sclerosis and Pain. J Med Chem59:2612-32 (2016) 
 
Fatty-acid amide hydrolase 1
Name:Fatty-acid amide hydrolase 1
Type:Protein
Mol. Mass.:63071.19
Organism:Homo sapiens (Human)
Description:O00519
Residue:579
BDBM50160284
NameBDBM50160284
Synonyms:CHEMBL3785379
TypeSmall organic molecule
Emp. Form.C24H22FN5O4
Mol. Mass.463.461
SMILESFc1ccc(cc1)[C@@H]1[C@H](N(C2CCN(CC2)C(=O)n2cncn2)C1=O)c1ccc2OCOc2c1