Reaction Details
TargetATP-sensitive inward rectifier potassium channel 1
LigandBDBM50163359
Substrate/Competitorn/a
Meas. Tech.ChEMBL_1571175 (CHEMBL3797006)
IC50 95±n/a nM
Citation Walsh, SPShahripour, ATang, Hde Jesus, RKTeumelsan, NZhu, YFrie, JPriest, BTSwensen, AMAlonso-Galicia, MFelix, JPBrochu, RMBailey, TThomas-Fowlkes, BZhou, XPai, LYHampton, CHernandez, MOwens, KEhrhart, JRoy, SKaczorowski, GJYang, LGarcia, MLPasternak, A Differentiation of ROMK potency from hERG potency in the phenacetyl piperazine series through heterocycle incorporation. Bioorg Med Chem Lett26:2339-43 (2016) 
 
ATP-sensitive inward rectifier potassium channel 1
Name:ATP-sensitive inward rectifier potassium channel 1
Type:Enzyme Catalytic Domain
Mol. Mass.:44809.08
Organism:Homo sapiens (Human)
Description:gi_223460826
Residue:391
BDBM50163359
NameBDBM50163359
Synonyms:CHEMBL3794292
TypeSmall organic molecule
Emp. Form.C24H27N7O3
Mol. Mass.461.5163
SMILESCC(CN1CCN(CC1)C(=O)Cc1ccc(nc1)-n1cnnn1)c1ccc2C(=O)OCc2c1C