Reaction Details
TargetPotassium voltage-gated channel subfamily H member 2
LigandBDBM50163365
Substrate/Competitorn/a
Meas. Tech.ChEMBL_1571178 (CHEMBL3797009)
IC50 5000±n/a nM
Citation Walsh, SPShahripour, ATang, Hde Jesus, RKTeumelsan, NZhu, YFrie, JPriest, BTSwensen, AMAlonso-Galicia, MFelix, JPBrochu, RMBailey, TThomas-Fowlkes, BZhou, XPai, LYHampton, CHernandez, MOwens, KEhrhart, JRoy, SKaczorowski, GJYang, LGarcia, MLPasternak, A Differentiation of ROMK potency from hERG potency in the phenacetyl piperazine series through heterocycle incorporation. Bioorg Med Chem Lett26:2339-43 (2016) 
 
Potassium voltage-gated channel subfamily H member 2
Name:Potassium voltage-gated channel subfamily H member 2
Type:Multi-pass membrane protein
Mol. Mass.:126672.65
Organism:Homo sapiens (Human)
Description:Q12809
Residue:1159
BDBM50163365
NameBDBM50163365
Synonyms:CHEMBL3794249
TypeSmall organic molecule
Emp. Form.C24H23N5O3
Mol. Mass.429.4711
SMILESO=C(Cc1ccc(cc1)-n1cnnn1)N1CC2C(CCc3ccc4C(=O)OCc4c3)C2C1