Reaction Details
TargetPotassium voltage-gated channel subfamily H member 2
LigandBDBM50163369
Substrate/Competitorn/a
Meas. Tech.ChEMBL_1571178 (CHEMBL3797009)
IC50 6500±n/a nM
Citation Walsh, SPShahripour, ATang, Hde Jesus, RKTeumelsan, NZhu, YFrie, JPriest, BTSwensen, AMAlonso-Galicia, MFelix, JPBrochu, RMBailey, TThomas-Fowlkes, BZhou, XPai, LYHampton, CHernandez, MOwens, KEhrhart, JRoy, SKaczorowski, GJYang, LGarcia, MLPasternak, A Differentiation of ROMK potency from hERG potency in the phenacetyl piperazine series through heterocycle incorporation. Bioorg Med Chem Lett26:2339-43 (2016) 
 
Potassium voltage-gated channel subfamily H member 2
Name:Potassium voltage-gated channel subfamily H member 2
Type:Multi-pass membrane protein
Mol. Mass.:126672.65
Organism:Homo sapiens (Human)
Description:Q12809
Residue:1159
BDBM50163369
NameBDBM50163369
Synonyms:CHEMBL3792861
TypeSmall organic molecule
Emp. Form.C24H25N5O4
Mol. Mass.447.4864
SMILESOC1(CCc2ccc3C(=O)OCc3c2)CCN(CC1)C(=O)Cc1ccc(cc1)-n1cnnn1