Reaction Details
TargetBeta-secretase 1
LigandBDBM50164510
Substrate/Competitorn/a
Meas. Tech.ChEMBL_1574684 (CHEMBL3801551)
IC50 40±n/a nM
Citation Mandal, MWu, YMisiaszek, JLi, GBuevich, ACaldwell, JPLiu, XMazzola, RDOrth, PStrickland, CVoigt, JWang, HZhu, ZChen, XGrzelak, MHyde, LAKuvelkar, RLeach, PTTerracina, GZhang, LZhang, QMichener, MSSmith, BCox, KGrotz, DFavreau, LMitra, KKazakevich, IMcKittrick, BAGreenlee, WKennedy, MEParker, EMCumming, JNStamford, AW Structure-Based Design of an Iminoheterocyclicß-Site Amyloid Precursor Protein Cleaving Enzyme (BACE) Inhibitor that Lowers Central Aß in Nonhuman Primates. J Med Chem59:3231-48 (2016) 
 
Beta-secretase 1
Name:Beta-secretase 1
Type:Protein
Mol. Mass.:55755.10
Organism:Homo sapiens (Human)
Description:P56817
Residue:501
BDBM50164510
NameBDBM50164510
Synonyms:CHEMBL3798544
TypeSmall organic molecule
Emp. Form.C18H18FN7O2S
Mol. Mass.415.445
SMILES[H][C@@]12CN(C[C@@]1(NC(=N)N(C)C2=O)c1ccc(s1)C#N)c1nc(C)c(F)c(OC)n1