Reaction Details
TargetMicrotubule-associated protein 2
LigandBDBM50167901
Substrate/Competitorn/a
Meas. Tech.ChEMBL_1574297 (CHEMBL3802682)
IC50 2800±n/a nM
Citation Cheruvallath, ZTang, MMcBride, CKomandla, MMiura, JTon-Nu, TErikson, PFeng, JFarrell, PLawson, JDVanderpool, DWu, YDougan, DRPlonowski, AHolub, CLarson, C Discovery of potent, reversible MetAP2 inhibitors via fragment based drug discovery and structure based drug design-Part 1. Bioorg Med Chem Lett26:2774-2778 (2016) 
 
Microtubule-associated protein 2
Name:Microtubule-associated protein 2
Type:PROTEIN
Mol. Mass.:199423.64
Organism:Homo sapiens (Human)
Description:ChEMBL_107603
Residue:1827
BDBM50167901
NameBDBM50167901
Synonyms:CHEMBL3798369
TypeSmall organic molecule
Emp. Form.C7H5BrN2O
Mol. Mass.213.031
SMILESOc1n[nH]c2cc(Br)ccc12