Reaction Details
TargetMicrotubule-associated protein 2
LigandBDBM50167922
Substrate/Competitorn/a
Meas. Tech.ChEMBL_1574297 (CHEMBL3802682)
IC50 5.0±n/a nM
Citation Cheruvallath, ZTang, MMcBride, CKomandla, MMiura, JTon-Nu, TErikson, PFeng, JFarrell, PLawson, JDVanderpool, DWu, YDougan, DRPlonowski, AHolub, CLarson, C Discovery of potent, reversible MetAP2 inhibitors via fragment based drug discovery and structure based drug design-Part 1. Bioorg Med Chem Lett26:2774-2778 (2016) 
 
Microtubule-associated protein 2
Name:Microtubule-associated protein 2
Type:PROTEIN
Mol. Mass.:199423.64
Organism:Homo sapiens (Human)
Description:ChEMBL_107603
Residue:1827
BDBM50167922
NameBDBM50167922
Synonyms:CHEMBL3797286
TypeSmall organic molecule
Emp. Form.C15H12F3N3O2
Mol. Mass.323.2699
SMILESCOc1ccc(c(OC)n1)-c1cc(cc2[nH]ncc12)C(F)(F)F