Reaction Details
TargetCytochrome P450 1A2
LigandBDBM50167959
Substrate/Competitorn/a
Meas. Tech.ChEMBL_1574299 (CHEMBL3802684)
IC50<50119±n/a nM
Citation Cheruvallath, ZTang, MMcBride, CKomandla, MMiura, JTon-Nu, TErikson, PFeng, JFarrell, PLawson, JDVanderpool, DWu, YDougan, DRPlonowski, AHolub, CLarson, C Discovery of potent, reversible MetAP2 inhibitors via fragment based drug discovery and structure based drug design-Part 1. Bioorg Med Chem Lett26:2774-2778 (2016) 
 
Cytochrome P450 1A2
Name:Cytochrome P450 1A2
Type:Enzyme
Mol. Mass.:58423.38
Organism:Homo sapiens (Human)
Description:P05177
Residue:516
BDBM50167959
NameBDBM50167959
Synonyms:CHEMBL3799242
TypeSmall organic molecule
Emp. Form.C18H17F3N4O
Mol. Mass.362.349
SMILESCc1nc(ccc1-c1cc(cc2[nH]ncc12)C(F)(F)F)N1CC[C@H](O)C1