Reaction Details
TargetMicrotubule-associated protein 2
LigandBDBM50167960
Substrate/Competitorn/a
Meas. Tech.ChEMBL_1574308 (CHEMBL3802693)
EC50 15±n/a nM
Citation Cheruvallath, ZTang, MMcBride, CKomandla, MMiura, JTon-Nu, TErikson, PFeng, JFarrell, PLawson, JDVanderpool, DWu, YDougan, DRPlonowski, AHolub, CLarson, C Discovery of potent, reversible MetAP2 inhibitors via fragment based drug discovery and structure based drug design-Part 1. Bioorg Med Chem Lett26:2774-2778 (2016) 
 
Microtubule-associated protein 2
Name:Microtubule-associated protein 2
Type:PROTEIN
Mol. Mass.:199423.64
Organism:Homo sapiens (Human)
Description:ChEMBL_107603
Residue:1827
BDBM50167960
NameBDBM50167960
Synonyms:CHEMBL3799512
TypeSmall organic molecule
Emp. Form.C17H16F3N5O
Mol. Mass.363.337
SMILESCc1nc(ncc1-c1cc(cc2[nH]ncc12)C(F)(F)F)N1CC[C@@H](O)C1