Reaction Details
TargetHexokinase-1
LigandBDBM50169037
Substrate/Competitorn/a
Meas. Tech.ChEMBL_1577557 (CHEMBL3807033)
IC50 20±n/a nM
Citation Lin, HZeng, JXie, RSchulz, MJTedesco, RQu, JErhard, KFMack, JFRaha, KRendina, ARSzewczuk, LMKratz, PMJurewicz, AJCecconie, TMartens, SMcDevitt, PJMartin, JDChen, SBJiang, YNickels, LSchwartz, BJSmallwood, AZhao, BCampobasso, NQian, YBriand, JRominger, CMOleykowski, CHardwicke, MALuengo, JI Discovery of a Novel 2,6-Disubstituted Glucosamine Series of Potent and Selective Hexokinase 2 Inhibitors. ACS Med Chem Lett7:217-22 (2016) 
 
Hexokinase-1
Name:Hexokinase-1
Type:PROTEIN
Mol. Mass.:102488.34
Organism:Homo sapiens (Human)
Description:EBI_11382
Residue:917
BDBM50169037
NameBDBM50169037
Synonyms:CHEMBL3805205
TypeSmall organic molecule
Emp. Form.C19H21BrN2O10S
Mol. Mass.549.346
SMILESCc1oc(cc1C(O)=O)S(=O)(=O)NC[C@H]1OC(O)[C@H](NC(=O)c2cccc(Br)c2)[C@@H](O)[C@@H]1O