Reaction Details
TargetHexokinase-1
LigandBDBM50169043
Substrate/Competitorn/a
Meas. Tech.ChEMBL_1577557 (CHEMBL3807033)
IC50>20000±n/a nM
Citation Lin, HZeng, JXie, RSchulz, MJTedesco, RQu, JErhard, KFMack, JFRaha, KRendina, ARSzewczuk, LMKratz, PMJurewicz, AJCecconie, TMartens, SMcDevitt, PJMartin, JDChen, SBJiang, YNickels, LSchwartz, BJSmallwood, AZhao, BCampobasso, NQian, YBriand, JRominger, CMOleykowski, CHardwicke, MALuengo, JI Discovery of a Novel 2,6-Disubstituted Glucosamine Series of Potent and Selective Hexokinase 2 Inhibitors. ACS Med Chem Lett7:217-22 (2016) 
 
Hexokinase-1
Name:Hexokinase-1
Type:PROTEIN
Mol. Mass.:102488.34
Organism:Homo sapiens (Human)
Description:EBI_11382
Residue:917
BDBM50169043
NameBDBM50169043
Synonyms:CHEMBL3806095
TypeSmall organic molecule
Emp. Form.C18H18Cl4N2O8S2
Mol. Mass.596.286
SMILESOC1O[C@H](CNS(=O)(=O)c2cccc(Cl)c2Cl)[C@@H](O)[C@H](O)[C@H]1NS(=O)(=O)c1ccc(Cl)c(Cl)c1