Reaction Details
TargetHexokinase-2
LigandBDBM50169022
Substrate/Competitorn/a
Meas. Tech.ChEMBL_1577558 (CHEMBL3807034)
IC50>400000±n/a nM
Citation Lin, HZeng, JXie, RSchulz, MJTedesco, RQu, JErhard, KFMack, JFRaha, KRendina, ARSzewczuk, LMKratz, PMJurewicz, AJCecconie, TMartens, SMcDevitt, PJMartin, JDChen, SBJiang, YNickels, LSchwartz, BJSmallwood, AZhao, BCampobasso, NQian, YBriand, JRominger, CMOleykowski, CHardwicke, MALuengo, JI Discovery of a Novel 2,6-Disubstituted Glucosamine Series of Potent and Selective Hexokinase 2 Inhibitors. ACS Med Chem Lett7:217-22 (2016) 
 
Hexokinase-2
Name:Hexokinase-2
Type:PROTEIN
Mol. Mass.:102369.70
Organism:Homo sapiens (Human)
Description:ChEMBL_11422
Residue:917
BDBM50169022
NameBDBM50169022
Synonyms:CHEMBL3805752
TypeSmall organic molecule
Emp. Form.C15H17Cl2NO5
Mol. Mass.362.205
SMILESOC[C@H]1OC[C@H](NC(=O)\C=C\c2ccc(Cl)c(Cl)c2)[C@@H](O)[C@@H]1O