Reaction Details
TargetSodium channel protein type 9 subunit alpha
LigandBDBM50169430
Substrate/Competitorn/a
Meas. Tech.ChEMBL_1577992 (CHEMBL3806691)
IC50 3.6±n/a nM
Citation Focken, TLiu, SChahal, NDauphinais, MGrimwood, MEChowdhury, SHemeon, IBichler, PBogucki, DWaldbrook, MBankar, GSojo, LEYoung, CLin, SShuart, NKwan, RPang, JChang, JHSafina, BSSutherlin, DPJohnson, JPDehnhardt, CMMansour, TSOballa, RMCohen, CJRobinette, CL Discovery of Aryl Sulfonamides as Isoform-Selective Inhibitors of NaV1.7 with Efficacy in Rodent Pain Models. ACS Med Chem Lett7:277-82 (2016) 
 
Sodium channel protein type 9 subunit alpha
Name:Sodium channel protein type 9 subunit alpha
Type:Protein
Mol. Mass.:226375.97
Organism:Homo sapiens (Human)
Description:Q15858
Residue:1988
BDBM50169430
NameBDBM50169430
Synonyms:CHEMBL3805347 | US9481677, 59
TypeSmall organic molecule
Emp. Form.C22H12ClF2N5O3S2
Mol. Mass.531.942
SMILESFc1cc(c(F)cc1Oc1ccc(Cl)cc1-c1ccc2nccnc2c1)S(=O)(=O)Nc1ncns1