Reaction Details
TargetSodium channel protein type 3 subunit alpha
LigandBDBM50118514
Substrate/Competitorn/a
Meas. Tech.ChEMBL_1578093 (CHEMBL3806982)
IC50 9330±n/a nM
Citation Focken, TLiu, SChahal, NDauphinais, MGrimwood, MEChowdhury, SHemeon, IBichler, PBogucki, DWaldbrook, MBankar, GSojo, LEYoung, CLin, SShuart, NKwan, RPang, JChang, JHSafina, BSSutherlin, DPJohnson, JPDehnhardt, CMMansour, TSOballa, RMCohen, CJRobinette, CL Discovery of Aryl Sulfonamides as Isoform-Selective Inhibitors of NaV1.7 with Efficacy in Rodent Pain Models. ACS Med Chem Lett7:277-82 (2016) 
 
Sodium channel protein type 3 subunit alpha
Name:Sodium channel protein type 3 subunit alpha
Type:Protein
Mol. Mass.:226276.42
Organism:Homo sapiens (Human)
Description:Q9NY46
Residue:2000
BDBM50118514
NameBDBM50118514
Synonyms:CHEMBL3617063 | US9481677, 38
TypeSmall organic molecule
Emp. Form.C21H13ClF2N6O3S2
Mol. Mass.534.946
SMILESNc1nc2cc(ccc2[nH]1)-c1cc(Cl)ccc1Oc1cc(F)c(cc1F)S(=O)(=O)Nc1ncns1