Reaction Details
TargetVascular endothelial growth factor receptor 2
LigandBDBM50021574
Substrate/Competitorn/a
Meas. Tech.ChEMBL_1581706 (CHEMBL3816039)
IC50 0.035000±n/a nM
Citation Qiang, HGu, WHuang, DShi, WQiu, QDai, YHuang, WQian, H Design, synthesis and biological evaluation of 4-aminopyrimidine-5-cabaldehyde oximes as dual inhibitors of c-Met and VEGFR-2. Bioorg Med Chem24:3353-8 (2016) 
 
Vascular endothelial growth factor receptor 2
Name:Vascular endothelial growth factor receptor 2
Type:Receptor Tyrosine Kinase
Mol. Mass.:151510.97
Organism:Homo sapiens (Human)
Description:P35968
Residue:1356
BDBM50021574
NameBDBM50021574
Synonyms:BMS-907351 CHEBI:72317 Cometriq US10202365, Compound Cabozantinib US10273211, Compound Cabozantinib US10774070, Compound Cabozantinib XL-184 | cabozantinib s-malate
TypeSmall organic molecule
Emp. Form.C28H24FN3O5
Mol. Mass.501.5057
SMILESCOc1cc2nccc(Oc3ccc(NC(=O)C4(CC4)C(=O)Nc4ccc(F)cc4)cc3)c2cc1OC