Reaction Details
TargetSucrase-isomaltase, intestinal
LigandBDBM50180579
Substrate/Competitorn/a
Meas. Tech.ChEMBL_1583832 (CHEMBL3815264)
IC50 470±n/a nM
Citation Tanabe, GXie, WBalakishan, GAmer, MFTsutsui, NTakemura, HNakamura, SAkaki, JNinomiya, KMorikawa, TNakanishi, IMuraoka, O Hydrophobic substituents increase the potency of salacinol, a potenta-glucosidase inhibitor from Ayurvedic traditional medicine 'Salacia'. Bioorg Med Chem24:3705-15 (2016) 
 
Sucrase-isomaltase, intestinal
Name:Sucrase-isomaltase, intestinal
Type:Enzyme
Mol. Mass.:210329.04
Organism:Rattus norvegicus (Rat)
Description:P23739
Residue:1841
BDBM50180579
NameBDBM50180579
Synonyms:CHEMBL3814555
TypeSmall organic molecule
Emp. Form.C14H29ClO6S
Mol. Mass.360.894
SMILES[Cl-].CCCCCO[C@@H](CO)[C@H](O)C[S+]1C[C@@H](O)[C@H](O)[C@H]1CO