Reaction Details
TargetKelch-like ECH-associated protein 1
LigandBDBM50180851
Substrate/Competitorn/a
Meas. Tech.ChEMBL_1584808 (CHEMBL3822031)
Kd 670±n/a nM
Citation Davies, TGWixted, WECoyle, JEGriffiths-Jones, CHearn, KMcMenamin, RNorton, DRich, SJRichardson, CSaxty, GWillems, HMWoolford, AJCottom, JEKou, JPYonchuk, JGFeldser, HGSanchez, YFoley, JPBolognese, BJLogan, GPodolin, PLYan, HCallahan, JFHeightman, TDKerns, JK Monoacidic Inhibitors of the Kelch-like ECH-Associated Protein 1: Nuclear Factor Erythroid 2-Related Factor 2 (KEAP1:NRF2) Protein-Protein Interaction with High Cell Potency Identified by Fragment-Based Discovery. J Med Chem59:3991-4006 (2016) 
 
Kelch-like ECH-associated protein 1
Name:Kelch-like ECH-associated protein 1
Type:PROTEIN
Mol. Mass.:69664.53
Organism:Homo sapiens (Human)
Description:ChEMBL_107924
Residue:624
BDBM50180851
NameBDBM50180851
Synonyms:CHEMBL3818085 | US10144731, Example 54
TypeSmall organic molecule
Emp. Form.C24H23ClN4O4S
Mol. Mass.498.982
SMILESCN(Cc1cc(ccc1Cl)[C@H](CC(O)=O)c1ccc2n(C)nnc2c1)S(=O)(=O)c1ccccc1