Reaction Details
TargetKelch-like ECH-associated protein 1
LigandBDBM50180853
Substrate/Competitorn/a
Meas. Tech.ChEMBL_1584808 (CHEMBL3822031)
Kd 59000±n/a nM
Citation Davies, TGWixted, WECoyle, JEGriffiths-Jones, CHearn, KMcMenamin, RNorton, DRich, SJRichardson, CSaxty, GWillems, HMWoolford, AJCottom, JEKou, JPYonchuk, JGFeldser, HGSanchez, YFoley, JPBolognese, BJLogan, GPodolin, PLYan, HCallahan, JFHeightman, TDKerns, JK Monoacidic Inhibitors of the Kelch-like ECH-Associated Protein 1: Nuclear Factor Erythroid 2-Related Factor 2 (KEAP1:NRF2) Protein-Protein Interaction with High Cell Potency Identified by Fragment-Based Discovery. J Med Chem59:3991-4006 (2016) 
 
Kelch-like ECH-associated protein 1
Name:Kelch-like ECH-associated protein 1
Type:PROTEIN
Mol. Mass.:69664.53
Organism:Homo sapiens (Human)
Description:ChEMBL_107924
Residue:624
BDBM50180853
NameBDBM50180853
Synonyms:CHEMBL3819386
TypeSmall organic molecule
Emp. Form.C16H14ClN3O2
Mol. Mass.315.754
SMILESCn1nnc2cc(ccc12)C(CC(O)=O)c1ccc(Cl)cc1