Reaction Details
TargetSialidase-4
LigandBDBM50182216
Substrate/Competitorn/a
Meas. Tech.ChEMBL_1585709 (CHEMBL3821006)
IC50>700000±n/a nM
Citation Sriwilaijaroen, NMagesh, SImamura, AAndo, HIshida, HSakai, MIshitsubo, EHori, TMoriya, SIshikawa, TKuwata, KOdagiri, TTashiro, MHiramatsu, HTsukamoto, KMiyagi, TTokiwa, HKiso, MSuzuki, Y A Novel Potent and Highly Specific Inhibitor against Influenza Viral N1-N9 Neuraminidases: Insight into Neuraminidase-Inhibitor Interactions. J Med Chem59:4563-77 (2016) 
 
Sialidase-4
Name:Sialidase-4
Type:PROTEIN
Mol. Mass.:51579.82
Organism:Homo sapiens (Human)
Description:ChEMBL_960637
Residue:484
BDBM50182216
NameBDBM50182216
Synonyms:CHEMBL3819510
TypeSmall organic molecule
Emp. Form.C19H30F3N5O9
Mol. Mass.529.4648
SMILESOC(=O)C(F)(F)F.[H][C@]1(OC(=C[C@H](NC(N)=N)[C@H]1NC(C)=O)C(O)=O)[C@H](O)[C@H](O)CNC(=O)CCCC