Reaction Details
TargetNeuraminidase
LigandBDBM50182249
Substrate/Competitorn/a
Meas. Tech.ChEMBL_1585711 (CHEMBL3821008)
IC50 3.1±n/a nM
Citation Sriwilaijaroen, NMagesh, SImamura, AAndo, HIshida, HSakai, MIshitsubo, EHori, TMoriya, SIshikawa, TKuwata, KOdagiri, TTashiro, MHiramatsu, HTsukamoto, KMiyagi, TTokiwa, HKiso, MSuzuki, Y A Novel Potent and Highly Specific Inhibitor against Influenza Viral N1-N9 Neuraminidases: Insight into Neuraminidase-Inhibitor Interactions. J Med Chem59:4563-77 (2016) 
 
Neuraminidase
Name:Neuraminidase
Type:PROTEIN
Mol. Mass.:49687.56
Organism:Influenza A virus
Description:ChEMBL_1347422
Residue:453
BDBM50182249
NameBDBM50182249
Synonyms:CHEMBL3818159
TypeSmall organic molecule
Emp. Form.C15H29N2O8P
Mol. Mass.396.3731
SMILESOP(O)(O)=O.CCC(CC)OC[C@@H]1CC(=C[C@H](N)[C@H]1NC(C)=O)C(O)=O