Reaction Details
TargetALK tyrosine kinase receptor
LigandBDBM50185246
Substrate/Competitorn/a
Meas. Tech.ChEMBL_1587416 (CHEMBL3824709)
IC50 0.760000±n/a nM
Citation Huang, WSLiu, SZou, DThomas, MWang, YZhou, TRomero, JKohlmann, ALi, FQi, JCai, LDwight, TAXu, YXu, RDodd, RToms, AParillon, LLu, XAnjum, RZhang, SWang, FKeats, JWardwell, SDNing, YXu, QMoran, LEMohemmad, QKJang, HGClackson, TNarasimhan, NIRivera, VMZhu, XDalgarno, DShakespeare, WC Discovery of Brigatinib (AP26113), a Phosphine Oxide-Containing, Potent, Orally Active Inhibitor of Anaplastic Lymphoma Kinase. J Med Chem59:4948-64 (2016) 
 
ALK tyrosine kinase receptor
Name:ALK tyrosine kinase receptor
Type:Protein
Mol. Mass.:176453.10
Organism:Homo sapiens (Human)
Description:Q9UM73
Residue:1620
BDBM50185246
NameBDBM50185246
Synonyms:CHEMBL3822645
TypeSmall organic molecule
Emp. Form.C27H31ClN7O2P
Mol. Mass.552.008
SMILESCOc1cc(ccc1Nc1ncc(Cl)c(Nc2ccccc2P(C)(C)=O)n1)-c1cnn(c1)C1CCNCC1