Reaction Details
TargetCoagulation factor VII/Tissue factor
LigandBDBM50192771
Substrate/Competitorn/a
Meas. Tech.ChEMBL_1613695 (CHEMBL3855495)
Ki 0.550000±n/a nM
Citation Ladziata, VUGlunz, PWZou, YZhang, XJiang, WJacutin-Porte, SCheney, DLWei, ALuettgen, JMHarper, TMWong, PCSeiffert, DWexler, RRPriestley, ES Synthesis and P1' SAR exploration of potent macrocyclic tissue factor-factor VIIa inhibitors. Bioorg Med Chem Lett26:5051-5057 (2016) 
 
Coagulation factor VII/Tissue factor
Name:Coagulation factor VII/Tissue factor
Type:n/a
Mol. Mass.:n/a
Description:ASSAY_ID of EBI is 69535
Components:This complex has 2 components.
Component 1
Name:Tissue factor
Synonyms:CD_antigen=CD142 Coagulation factor VII/tissue factor TF Thromboplastin | Tissue factor
Type:PROTEIN
Mol. Mass.:33067.61
Organism:Homo sapiens (Human)
Description:ChEMBL_936735
Residue:295
Component 2
Name:Coagulation factor VII
Synonyms:Eptacog alfa FA7_HUMAN Factor VIIa (fVIIa) SPCA serum prothrombin conversion accelerator
Type:Enzyme
Mol. Mass.:51599.89
Organism:Homo sapiens (Human)
Description:n/a
Residue:466
BDBM50192771
NameBDBM50192771
Synonyms:CHEMBL3898371
TypeSmall organic molecule
Emp. Form.C34H34FN5O5
Mol. Mass.611.6627
SMILES[H][C@]1(C)COC(=O)Nc2ccc(c(CN(C)C(=O)[C@]([H])(Nc3ccc4c(c3)c(F)c[nH]c4=N)c3ccc1c(C)c3)c2)C1(CC1)C(O)=O