Reaction Details
TargetTransient receptor potential cation channel subfamily V member 4
LigandBDBM50192808
Substrate/Competitorn/a
Meas. Tech.ChEMBL_1613832 (CHEMBL3855632)
IC50 1.000000±n/a nM
Citation Tsuno, NYukimasa, AYoshida, OSuzuki, SNakai, HOgawa, TFujiu, MTakaya, KNozu, AYamaguchi, HMatsuda, HFunaki, SNishimura, YIto, TNagamatsu, DAsaki, THorita, NYamamoto, MHinata, MSoga, MImai, MMorioka, YKanemasa, TSakaguchi, GIso, Y Discovery of novel 2',4'-dimethyl-[4,5'-bithiazol]-2-yl amino derivatives as orally bioavailable TRPV4 antagonists for the treatment of pain: Part 2. Bioorg Med Chem Lett26:4936-4941 (2016) 
 
Transient receptor potential cation channel subfamily V member 4
Name:Transient receptor potential cation channel subfamily V member 4
Type:Enzyme
Mol. Mass.:98290.10
Organism:Homo sapiens (Human)
Description:Q9HBA0
Residue:871
BDBM50192808
NameBDBM50192808
Synonyms:CHEMBL3915150
TypeSmall organic molecule
Emp. Form.C22H24N6O2S2
Mol. Mass.468.595
SMILES[H][C@]12CC[C@]([H])(C\C(C1)=N/OC)N2C(=O)c1ccc(Nc2nc(cs2)-c2sc(C)nc2C)nc1