Reaction Details
TargetSteroid hormone receptor ERR2
LigandBDBM22435
Substrate/Competitorn/a
Meas. Tech.ChEMBL_1615021 (CHEMBL3857090)
IC50>10000±n/a nM
Citation Kim, JChin, JIm, CYYoo, EKWoo, SHwang, HJCho, JHSeo, KASong, JHwang, HKim, KHKim, NDYoon, SKJeon, JHYoon, SYJeon, YHChoi, HSLee, IKKim, SHCho, SJ Synthesis and biological evaluation of novel 4-hydroxytamoxifen analogs as estrogen-related receptor gamma inverse agonists. Eur J Med Chem120:338-52 (2016) 
 
Steroid hormone receptor ERR2
Name:Steroid hormone receptor ERR2
Type:PROTEIN
Mol. Mass.:48061.77
Organism:Homo sapiens (Human)
Description:ChEMBL_11254
Residue:433
BDBM22435
NameBDBM22435
Synonyms:4-[(1Z)-1-{4-[2-(dimethylamino)ethoxy]phenyl}-5-hydroxy-2-phenylpent-1-en-1-yl]phenol GSK 5182 US11285226, Compound GSK5182
TypeSmall organic molecule
Emp. Form.C27H31NO3
Mol. Mass.417.5399
SMILESCN(C)CCOc1ccc(cc1)C(=C(\CCCO)c1ccccc1)\c1ccc(O)cc1