Reaction Details
TargetHistone-arginine methyltransferase CARM1
LigandBDBM50194771
Substrate/Competitorn/a
Meas. Tech.ChEMBL_1616973 (CHEMBL3859042)
IC50 80±n/a nM
Citation Shen, YSzewczyk, MMEram, MSSmil, DKaniskan, HÜde Freitas, RFSenisterra, GLi, FSchapira, MBrown, PJArrowsmith, CHBarsyte-Lovejoy, DLiu, JVedadi, MJin, J Discovery of a Potent, Selective, and Cell-Active Dual Inhibitor of Protein Arginine Methyltransferase 4 and Protein Arginine Methyltransferase 6. J Med Chem59:9124-9139 (2016) 
 
Histone-arginine methyltransferase CARM1
Name:Histone-arginine methyltransferase CARM1
Type:Protein
Mol. Mass.:65855.47
Organism:Homo sapiens (Human)
Description:Q86X55
Residue:608
BDBM50194771
NameBDBM50194771
Synonyms:CHEMBL3969797
TypeSmall organic molecule
Emp. Form.C14H22N2
Mol. Mass.218.3379
SMILESCNCCN1CCC(Cc2ccccc2)C1