Reaction Details
TargetSigma non-opioid intracellular receptor 1
LigandBDBM50194756
Substrate/Competitorn/a
Meas. Tech.ChEMBL_1617020 (CHEMBL3859089)
Ki 64±n/a nM
Citation Shen, YSzewczyk, MMEram, MSSmil, DKaniskan, HÜde Freitas, RFSenisterra, GLi, FSchapira, MBrown, PJArrowsmith, CHBarsyte-Lovejoy, DLiu, JVedadi, MJin, J Discovery of a Potent, Selective, and Cell-Active Dual Inhibitor of Protein Arginine Methyltransferase 4 and Protein Arginine Methyltransferase 6. J Med Chem59:9124-9139 (2016) 
 
Sigma non-opioid intracellular receptor 1
Name:Sigma non-opioid intracellular receptor 1
Type:Protein
Mol. Mass.:25307.17
Organism:Cavia porcellus (Guinea pig)
Description:Q60492
Residue:223
BDBM50194756
NameBDBM50194756
Synonyms:CHEMBL3961701
TypeSmall organic molecule
Emp. Form.C15H24N2O
Mol. Mass.248.3639
SMILESCNCCN1CCC(CC1)OCc1ccccc1